Information card for entry 7221968
Formula |
C30 H29 N3 O8 S2 |
Calculated formula |
C30 H29 N3 O8 S2 |
Title of publication |
Cs2CO3-promoted [3+2] cycloaddition providing an easy protocol toward imidazo[1,2-a]indole derivatives |
Authors of publication |
Zhang, Li-Dan; Qiu, Jiang-Kai; Kong, Li-Fang; Hao, Wen-Juan; Miao, Jiao-Na; Wu, Shuo; Jiang, Bo; Tu, Shu-Jiang |
Journal of publication |
RSC Adv. |
Year of publication |
2015 |
a |
11.1624 ± 0.0009 Å |
b |
21.9285 ± 0.0018 Å |
c |
12.3607 ± 0.0008 Å |
α |
90° |
β |
95.498 ± 0.002° |
γ |
90° |
Cell volume |
3011.7 ± 0.4 Å3 |
Cell temperature |
293 ± 2 K |
Ambient diffraction temperature |
293 ± 2 K |
Number of distinct elements |
5 |
Space group number |
14 |
Hermann-Mauguin space group symbol |
P 1 21/n 1 |
Hall space group symbol |
-P 2yn |
Residual factor for all reflections |
0.1795 |
Residual factor for significantly intense reflections |
0.0677 |
Weighted residual factors for significantly intense reflections |
0.0859 |
Weighted residual factors for all reflections included in the refinement |
0.1211 |
Goodness-of-fit parameter for all reflections included in the refinement |
0.919 |
Diffraction radiation wavelength |
1.54178 Å |
Diffraction radiation type |
CuKα |
Yes |
Yes |
No |