Information card for entry 7221993
Chemical name | 2-(2-nitrobenzylidene)-1-(phthalazin-1(2H)-ylidene)hydrazinium chloride hemihydrate |
Formula | C30 H26 Cl2 N10 O5 |
Calculated formula | C30 H26 Cl2 N10 O5 |
Title of publication | Solid-state studies of phthalazinylhydrazones and triazolophthalazines: the role of the nitro group |
Authors of publication | Trzesowska-Kruszynska, Agata |
Journal of publication | CrystEngComm |
Year of publication | 2015 |
Journal volume | 17 |
Journal issue | 40 |
Pages of publication | 7702 |
a | 15.7972 ± 0.0007 Å |
b | 9.2961 ± 0.0004 Å |
c | 21.2681 ± 0.001 Å |
α | 90° |
β | 106.516 ± 0.002° |
γ | 90° |
Cell volume | 2994.4 ± 0.2 Å3 |
Cell temperature | 100 ± 0.1 K |
Ambient diffraction temperature | 100 ± 0.1 K |
Number of distinct elements | 5 |
Space group number | 14 |
Hermann-Mauguin space group symbol | P 1 21/c 1 |
Hall space group symbol | -P 2ybc |
Residual factor for all reflections | 0.0459 |
Residual factor for significantly intense reflections | 0.0452 |
Weighted residual factors for significantly intense reflections | 0.1265 |
Weighted residual factors for all reflections included in the refinement | 0.1271 |
Goodness-of-fit parameter for all reflections included in the refinement | 1.058 |
Diffraction radiation wavelength | 1.54178 Å |
Diffraction radiation type | CuKα |