Information card for entry 7221998
Chemical name | 2-(4-nitrobenzylidene)-1-(phthalazin-1(2H)-ylidene)hydrazinium chloride methanol solvate |
Formula | C31 H28 Cl2 N10 O5 |
Calculated formula | C31 H28 Cl2 N10 O5 |
Title of publication | Solid-state studies of phthalazinylhydrazones and triazolophthalazines: the role of the nitro group |
Authors of publication | Trzesowska-Kruszynska, Agata |
Journal of publication | CrystEngComm |
Year of publication | 2015 |
Journal volume | 17 |
Journal issue | 40 |
Pages of publication | 7702 |
a | 6.8464 ± 0.0007 Å |
b | 13.9346 ± 0.0011 Å |
c | 16.3696 ± 0.0014 Å |
α | 90° |
β | 95.459 ± 0.007° |
γ | 90° |
Cell volume | 1554.6 ± 0.2 Å3 |
Cell temperature | 100 ± 0.1 K |
Ambient diffraction temperature | 100 ± 0.1 K |
Number of distinct elements | 5 |
Space group number | 14 |
Hermann-Mauguin space group symbol | P 1 21/c 1 |
Hall space group symbol | -P 2ybc |
Residual factor for all reflections | 0.0278 |
Residual factor for significantly intense reflections | 0.0278 |
Weighted residual factors for significantly intense reflections | 0.0748 |
Weighted residual factors for all reflections included in the refinement | 0.0748 |
Goodness-of-fit parameter for all reflections included in the refinement | 1.08 |
Diffraction radiation wavelength | 1.54178 Å |
Diffraction radiation type | CuKα |