Information card for entry 7222004
Chemical name | 1-[(3-phenylprop-2-en-1-ylidene)hydrazinylidene]-1,2-dihydrophthalazine |
Formula | C17 H14 N4 |
Calculated formula | C17 H14 N4 |
SMILES | C\1(NN=Cc2c1cccc2)=N/N=C/C=C/c1ccccc1 |
Title of publication | Solid-state studies of phthalazinylhydrazones and triazolophthalazines: the role of the nitro group |
Authors of publication | Trzesowska-Kruszynska, Agata |
Journal of publication | CrystEngComm |
Year of publication | 2015 |
Journal volume | 17 |
Journal issue | 40 |
Pages of publication | 7702 |
a | 12.7373 ± 0.0009 Å |
b | 4.8963 ± 0.0005 Å |
c | 22.33 ± 0.0016 Å |
α | 90° |
β | 95.249 ± 0.009° |
γ | 90° |
Cell volume | 1386.8 ± 0.2 Å3 |
Cell temperature | 100 ± 0.1 K |
Ambient diffraction temperature | 100 ± 0.1 K |
Number of distinct elements | 3 |
Space group number | 14 |
Hermann-Mauguin space group symbol | P 1 21/c 1 |
Hall space group symbol | -P 2ybc |
Residual factor for all reflections | 0.0329 |
Residual factor for significantly intense reflections | 0.0315 |
Weighted residual factors for significantly intense reflections | 0.086 |
Weighted residual factors for all reflections included in the refinement | 0.0874 |
Goodness-of-fit parameter for all reflections included in the refinement | 1.059 |
Diffraction radiation wavelength | 1.54178 Å |
Diffraction radiation type | CuKα |