Information card for entry 7222019
Formula | C64 H50 Co2 N8 O19 S4 |
Calculated formula | C64 H44 Co2 N8 O19 S4 |
Title of publication | A series of entangled coordination polymers assembled by a V-shaped bisimidazole ligand and various dicarboxylic acids: synthesis, characterization and luminescence properties |
Authors of publication | Guo, Huadong; Yan, Yongnian; Wang, Nan; Guo, Xianmin; Zheng, Guoli; Qi, Yanjuan |
Journal of publication | CrystEngComm |
Year of publication | 2015 |
Journal volume | 17 |
Journal issue | 34 |
Pages of publication | 6512 |
a | 15.5721 ± 0.0011 Å |
b | 15.585 ± 0.0011 Å |
c | 15.7385 ± 0.0011 Å |
α | 66.294 ± 0.001° |
β | 86.318 ± 0.001° |
γ | 67.269 ± 0.001° |
Cell volume | 3206.8 ± 0.4 Å3 |
Cell temperature | 293 ± 2 K |
Ambient diffraction temperature | 293 ± 2 K |
Number of distinct elements | 6 |
Space group number | 2 |
Hermann-Mauguin space group symbol | P -1 |
Hall space group symbol | -P 1 |
Residual factor for all reflections | 0.0871 |
Residual factor for significantly intense reflections | 0.0513 |
Weighted residual factors for significantly intense reflections | 0.1528 |
Weighted residual factors for all reflections included in the refinement | 0.182 |
Goodness-of-fit parameter for all reflections included in the refinement | 1.02 |
Diffraction radiation wavelength | 0.71073 Å |
Diffraction radiation type | MoKα |
Duplicate of | 7221550 |