Information card for entry 7222029
Formula | C30 H37 N O3 |
Calculated formula | C30 H36.803 N O3 |
Title of publication | Structural transformations in crystals induced by radiation and pressure. Part 2. The path of a photochemical intramolecular reaction in crystals at different pressures |
Authors of publication | Konieczny, K.; Bąkowicz, J.; Turowska-Tyrk, I. |
Journal of publication | CrystEngComm |
Year of publication | 2015 |
Journal volume | 17 |
Journal issue | 40 |
Pages of publication | 7693 |
a | 6.0634 ± 0.0005 Å |
b | 8.424 ± 0.0008 Å |
c | 26.071 ± 0.006 Å |
α | 89.426 ± 0.014° |
β | 83.996 ± 0.013° |
γ | 76.122 ± 0.008° |
Cell volume | 1285.5 ± 0.3 Å3 |
Cell temperature | 299 ± 2 K |
Ambient diffraction temperature | 299 ± 2 K |
Cell measurement pressure | 300000 kPa |
Ambient diffracton pressure | 300000 kPa |
Number of distinct elements | 4 |
Space group number | 2 |
Hermann-Mauguin space group symbol | P -1 |
Hall space group symbol | -P 1 |
Residual factor for all reflections | 0.2094 |
Residual factor for significantly intense reflections | 0.0987 |
Weighted residual factors for significantly intense reflections | 0.2188 |
Weighted residual factors for all reflections included in the refinement | 0.2827 |
Goodness-of-fit parameter for all reflections included in the refinement | 1.05 |
Diffraction radiation wavelength | 0.71073 Å |
Diffraction radiation type | MoKα |