Information card for entry 7222032
Formula | C30 H37 N O3 |
Calculated formula | C30 H36.59 N O3 |
Title of publication | Structural transformations in crystals induced by radiation and pressure. Part 2. The path of a photochemical intramolecular reaction in crystals at different pressures |
Authors of publication | Konieczny, K.; Bąkowicz, J.; Turowska-Tyrk, I. |
Journal of publication | CrystEngComm |
Year of publication | 2015 |
Journal volume | 17 |
Journal issue | 40 |
Pages of publication | 7693 |
a | 6.035 ± 0.0015 Å |
b | 8.5245 ± 0.0015 Å |
c | 25.662 ± 0.009 Å |
α | 89.33 ± 0.03° |
β | 84.02 ± 0.04° |
γ | 76.051 ± 0.018° |
Cell volume | 1274.2 ± 0.6 Å3 |
Cell temperature | 299 ± 2 K |
Ambient diffraction temperature | 299 ± 2 K |
Cell measurement pressure | 300000 kPa |
Ambient diffracton pressure | 300000 kPa |
Number of distinct elements | 4 |
Space group number | 2 |
Hermann-Mauguin space group symbol | P -1 |
Hall space group symbol | -P 1 |
Residual factor for all reflections | 0.2888 |
Residual factor for significantly intense reflections | 0.1362 |
Weighted residual factors for significantly intense reflections | 0.3416 |
Weighted residual factors for all reflections included in the refinement | 0.426 |
Goodness-of-fit parameter for all reflections included in the refinement | 1.214 |
Diffraction radiation wavelength | 0.71073 Å |
Diffraction radiation type | MoKα |