Information card for entry 7222045
Formula | C31 H20 N3 O8 Zn2 |
Calculated formula | C31 H20 N3 O8 Zn2 |
Title of publication | A series of mixed-ligand 2D and 3D coordination polymers assembled from a novel multifunctional pyridine-tricarboxylate building block: hydrothermal syntheses, structural and topological diversity, and magnetic and luminescent properties |
Authors of publication | Gu, Jinzhong; Cui, Yanhui; Wu, Jiang; Kirillov, Alexander M. |
Journal of publication | RSC Adv. |
Year of publication | 2015 |
a | 8.7544 ± 0.0005 Å |
b | 8.4785 ± 0.0007 Å |
c | 39.392 ± 0.004 Å |
α | 90° |
β | 92.684 ± 0.007° |
γ | 90° |
Cell volume | 2920.6 ± 0.4 Å3 |
Cell temperature | 294.63 ± 0.1 K |
Ambient diffraction temperature | 294.63 ± 0.1 K |
Number of distinct elements | 5 |
Space group number | 14 |
Hermann-Mauguin space group symbol | P 1 21/c 1 |
Hall space group symbol | -P 2ybc |
Residual factor for all reflections | 0.135 |
Residual factor for significantly intense reflections | 0.0928 |
Weighted residual factors for significantly intense reflections | 0.2468 |
Weighted residual factors for all reflections included in the refinement | 0.262 |
Goodness-of-fit parameter for all reflections included in the refinement | 1.076 |
Diffraction radiation wavelength | 0.71073 Å |
Diffraction radiation type | MoKα |