Information card for entry 7222077
Formula | C33 H34 N4 O4 |
Calculated formula | C33 H34 N4 O4 |
SMILES | Oc1c(c(O)ccc1)C.Oc1c(c(O)ccc1)C.n1c2c(nc3c1cccc3)cccc2.n1ccc(N(C)C)cc1 |
Title of publication | Combinatorial crystal synthesis of ternary solids based on 2-methylresorcinol |
Authors of publication | Mir, Niyaz A.; Dubey, Ritesh; Tothadi, Srinu; Desiraju, Gautam R. |
Journal of publication | CrystEngComm |
Year of publication | 2015 |
Journal volume | 17 |
Journal issue | 41 |
Pages of publication | 7866 |
a | 7.734 ± 0.005 Å |
b | 9.196 ± 0.006 Å |
c | 20.844 ± 0.014 Å |
α | 101.37 ± 0.015° |
β | 94.21 ± 0.03° |
γ | 96.022 ± 0.017° |
Cell volume | 1438.6 ± 1.6 Å3 |
Cell temperature | 150 ± 2 K |
Ambient diffraction temperature | 150 ± 2 K |
Number of distinct elements | 4 |
Space group number | 2 |
Hermann-Mauguin space group symbol | P -1 |
Hall space group symbol | -P 1 |
Residual factor for all reflections | 0.1262 |
Residual factor for significantly intense reflections | 0.0729 |
Weighted residual factors for significantly intense reflections | 0.1821 |
Weighted residual factors for all reflections included in the refinement | 0.2307 |
Goodness-of-fit parameter for all reflections included in the refinement | 1.074 |
Diffraction radiation wavelength | 0.71073 Å |
Diffraction radiation type | MoKα |