Information card for entry 7222080
Formula | C24 H28 N4 O2 |
Calculated formula | C24 H28 N4 O2 |
SMILES | Oc1c(c(O)ccc1)C.n1c(c(nc2c1cccc2)C)C.N(c1ccncc1)(C)C |
Title of publication | Combinatorial crystal synthesis of ternary solids based on 2-methylresorcinol |
Authors of publication | Mir, Niyaz A.; Dubey, Ritesh; Tothadi, Srinu; Desiraju, Gautam R. |
Journal of publication | CrystEngComm |
Year of publication | 2015 |
Journal volume | 17 |
Journal issue | 41 |
Pages of publication | 7866 |
a | 7.635 ± 0.005 Å |
b | 9.055 ± 0.008 Å |
c | 17.237 ± 0.013 Å |
α | 96.22 ± 0.03° |
β | 94.09 ± 0.02° |
γ | 113.734 ± 0.015° |
Cell volume | 1075.8 ± 1.4 Å3 |
Cell temperature | 150 ± 2 K |
Ambient diffraction temperature | 150 ± 2 K |
Number of distinct elements | 4 |
Space group number | 2 |
Hermann-Mauguin space group symbol | P -1 |
Hall space group symbol | -P 1 |
Residual factor for all reflections | 0.0675 |
Residual factor for significantly intense reflections | 0.0586 |
Weighted residual factors for significantly intense reflections | 0.1696 |
Weighted residual factors for all reflections included in the refinement | 0.1865 |
Goodness-of-fit parameter for all reflections included in the refinement | 1.02 |
Diffraction radiation wavelength | 0.71073 Å |
Diffraction radiation type | MoKα |