Information card for entry 7222235
Formula | C23 H42 N3 O3 P Pd |
Calculated formula | C23 H42 N3 O3 P Pd |
SMILES | [Pd]12([P](Oc3c2c(ccc3)C[N]1(C(C)C)C(C)C)(N(CC)CC)N(CC)CC)OC(=O)C |
Title of publication | Mono- and binuclear palladacycles via regioselective C‒H bond activation: syntheses, mechanistic insights and catalytic activity in direct arylation of azoles |
Authors of publication | Pandey, Dilip K.; Khake, Shrikant M.; Gonnade, Rajesh G.; PUNJI, BENUDHAR |
Journal of publication | RSC Adv. |
Year of publication | 2015 |
a | 11.5217 ± 0.0007 Å |
b | 12.4022 ± 0.0008 Å |
c | 18.4419 ± 0.0012 Å |
α | 90° |
β | 101.27 ± 0.002° |
γ | 90° |
Cell volume | 2584.4 ± 0.3 Å3 |
Cell temperature | 200 ± 2 K |
Ambient diffraction temperature | 200 ± 2 K |
Number of distinct elements | 6 |
Space group number | 14 |
Hermann-Mauguin space group symbol | P 1 21/c 1 |
Hall space group symbol | -P 2ybc |
Residual factor for all reflections | 0.022 |
Residual factor for significantly intense reflections | 0.0204 |
Weighted residual factors for significantly intense reflections | 0.0541 |
Weighted residual factors for all reflections included in the refinement | 0.0558 |
Goodness-of-fit parameter for all reflections included in the refinement | 1.16 |
Diffraction radiation wavelength | 0.71073 Å |
Diffraction radiation type | MoKα |