Information card for entry 7222271
Formula | C28 H20 N2 |
Calculated formula | C28 H20 N2 |
Title of publication | Gearing motion in cogwheel pairs of molecular rotors: weak-coupling limit |
Authors of publication | Kaleta, Jiří; Michl, Josef; Mézière, Cécile; Simonov, Sergey; Zorina, Leokadiya; Wzietek, Pawel; Rodríguez-Fortea, Antonio; Canadell, Enric; Batail, Patrick |
Journal of publication | CrystEngComm |
Year of publication | 2015 |
Journal volume | 17 |
Journal issue | 41 |
Pages of publication | 7829 |
a | 5.7123 ± 0.0019 Å |
b | 5.7076 ± 0.0017 Å |
c | 33.016 ± 0.018 Å |
α | 90° |
β | 93.68 ± 0.05° |
γ | 90° |
Cell volume | 1074.2 ± 0.8 Å3 |
Cell temperature | 293 ± 2 K |
Ambient diffraction temperature | 293 ± 2 K |
Number of distinct elements | 3 |
Space group number | 14 |
Hermann-Mauguin space group symbol | P 1 21/c 1 |
Hall space group symbol | -P 2ybc |
Residual factor for all reflections | 0.2607 |
Residual factor for significantly intense reflections | 0.0769 |
Weighted residual factors for significantly intense reflections | 0.1598 |
Weighted residual factors for all reflections included in the refinement | 0.2016 |
Goodness-of-fit parameter for all reflections included in the refinement | 0.861 |
Diffraction radiation wavelength | 0.71073 Å |
Diffraction radiation type | MoKα |