Information card for entry 7222316
Formula | C24 H21 N4 O9 S Sm |
Calculated formula | C24 H17 N4 O9 S Sm |
Title of publication | Controllable synthesis of four series of lanthanide coordination polymers: synthesis, structures, luminescent and magnetic properties |
Authors of publication | An, Ran; Wang, Xiaofang; Hu, Huai-Ming; Zhao, Zhui; Bai, Chao; Xue, Ganglin |
Journal of publication | CrystEngComm |
Year of publication | 2015 |
Journal volume | 17 |
Journal issue | 43 |
Pages of publication | 8289 |
a | 8.2415 ± 0.0008 Å |
b | 14.9167 ± 0.0015 Å |
c | 20.773 ± 0.002 Å |
α | 90° |
β | 98.86 ± 0.002° |
γ | 90° |
Cell volume | 2523.3 ± 0.4 Å3 |
Cell temperature | 296 ± 2 K |
Ambient diffraction temperature | 296 ± 2 K |
Number of distinct elements | 6 |
Space group number | 14 |
Hermann-Mauguin space group symbol | P 1 21/n 1 |
Hall space group symbol | -P 2yn |
Residual factor for all reflections | 0.0337 |
Residual factor for significantly intense reflections | 0.0267 |
Weighted residual factors for significantly intense reflections | 0.0604 |
Weighted residual factors for all reflections included in the refinement | 0.0636 |
Goodness-of-fit parameter for all reflections included in the refinement | 1.023 |
Diffraction radiation wavelength | 0.71073 Å |
Diffraction radiation type | MoKα |