Information card for entry 7222321
Formula | C24 H19 Gd N4 O8 S |
Calculated formula | C24 H19 Gd N4 O8 S |
Title of publication | Controllable synthesis of four series of lanthanide coordination polymers: synthesis, structures, luminescent and magnetic properties |
Authors of publication | An, Ran; Wang, Xiaofang; Hu, Huai-Ming; Zhao, Zhui; Bai, Chao; Xue, Ganglin |
Journal of publication | CrystEngComm |
Year of publication | 2015 |
Journal volume | 17 |
Journal issue | 43 |
Pages of publication | 8289 |
a | 8.9637 ± 0.0011 Å |
b | 9.0728 ± 0.001 Å |
c | 14.4541 ± 0.0017 Å |
α | 94.827 ± 0.002° |
β | 91.126 ± 0.002° |
γ | 98.795 ± 0.002° |
Cell volume | 1156.9 ± 0.2 Å3 |
Cell temperature | 296 ± 2 K |
Ambient diffraction temperature | 296 ± 2 K |
Number of distinct elements | 6 |
Space group number | 2 |
Hermann-Mauguin space group symbol | P -1 |
Hall space group symbol | -P 1 |
Residual factor for all reflections | 0.0282 |
Residual factor for significantly intense reflections | 0.0246 |
Weighted residual factors for significantly intense reflections | 0.0522 |
Weighted residual factors for all reflections included in the refinement | 0.0543 |
Goodness-of-fit parameter for all reflections included in the refinement | 1.049 |
Diffraction radiation wavelength | 0.71073 Å |
Diffraction radiation type | MoKα |