Information card for entry 7222343
Formula | C14 H19 Br N O3 |
Calculated formula | C14 H19 Br N O3 |
SMILES | c1(ccccc1Br)OC[C@H](C)NC(=O)OC(C)(C)C |
Title of publication | Copper-Catalysed Cross-Coupling Affected by the Smiles Rearrangement: A New Chapter on Diversifying the Synthesis of Chiral Fluorinated 1,4-Benzoxazine Derivatives |
Authors of publication | Alapour, Saba; Ramjugernath, Deresh; Koorbanally, Neil |
Journal of publication | RSC Adv. |
Year of publication | 2015 |
a | 23.738 ± 0.002 Å |
b | 5.1422 ± 0.0004 Å |
c | 12.9446 ± 0.0011 Å |
α | 90° |
β | 105.153 ± 0.007° |
γ | 90° |
Cell volume | 1525.2 ± 0.2 Å3 |
Cell temperature | 173 ± 2 K |
Ambient diffraction temperature | 173 ± 2 K |
Number of distinct elements | 5 |
Space group number | 5 |
Hermann-Mauguin space group symbol | C 1 2 1 |
Hall space group symbol | C 2y |
Residual factor for all reflections | 0.0861 |
Residual factor for significantly intense reflections | 0.0667 |
Weighted residual factors for significantly intense reflections | 0.1685 |
Weighted residual factors for all reflections included in the refinement | 0.1815 |
Goodness-of-fit parameter for all reflections included in the refinement | 1.065 |
Diffraction radiation probe | x-ray |
Diffraction radiation wavelength | 0.71073 Å |
Diffraction radiation type | MoKα |