Information card for entry 7222473
Formula | C28 H24 N2 O18 Zn3 |
Calculated formula | C28 H24 N2 O18 Zn3 |
Title of publication | A variety of metal-organic and supramolecular networks constructed from a new flexible multifunctional building block bearing picolinate and terephthalate functionalities: hydrothermal self-assembly, structural features, magnetic and luminescent properties |
Authors of publication | Shao, Yongliang; Cui, Yanhui; Gu, Jinzhong; Kirillov, Alexander M.; Wu, Jiang; Wang, Ya-Wen |
Journal of publication | RSC Adv. |
Year of publication | 2015 |
a | 29.702 ± 0.003 Å |
b | 6.166 ± 0.0003 Å |
c | 16.6016 ± 0.0008 Å |
α | 90° |
β | 94.853 ± 0.006° |
γ | 90° |
Cell volume | 3029.6 ± 0.4 Å3 |
Cell temperature | 290.92 ± 0.1 K |
Ambient diffraction temperature | 290.92 ± 0.1 K |
Number of distinct elements | 5 |
Space group number | 15 |
Hermann-Mauguin space group symbol | C 1 2/c 1 |
Hall space group symbol | -C 2yc |
Residual factor for all reflections | 0.0582 |
Residual factor for significantly intense reflections | 0.0395 |
Weighted residual factors for significantly intense reflections | 0.0784 |
Weighted residual factors for all reflections included in the refinement | 0.0817 |
Goodness-of-fit parameter for all reflections included in the refinement | 0.95 |
Diffraction radiation wavelength | 0.71073 Å |
Diffraction radiation type | MoKα |