Information card for entry 7222619
Chemical name |
Yb Ni0.55 Sb |
Formula |
Ni0.55 Sb Yb |
Calculated formula |
Ni0.56 Sb Yb |
Title of publication |
Ternary antimonides Yb T Sb (T = Ni, Pd, Pt, Cu, Ag, Au) - synthesis, structure, homogeneity ranges and (121)Sb Mossbauer spectroscopy |
Authors of publication |
Mishra, R.; Poettgen, R.; Hoffmann, R.D.; Trill, H.; Fickenscher, T.; Eschen, M.; Mosel, B.D. |
Journal of publication |
Zeitschrift fuer Naturforschung, Teil B. Anorganische Chemie, Organische Chemie (42,1987-) |
Year of publication |
2002 |
Journal volume |
57 |
Pages of publication |
1215 - 1223 |
a |
6.1951 Å |
b |
6.1951 Å |
c |
6.1951 Å |
α |
90° |
β |
90° |
γ |
90° |
Cell volume |
237.763 Å3 |
Number of distinct elements |
3 |
Space group number |
225 |
Hermann-Mauguin space group symbol |
F m -3 m |
Hall space group symbol |
-F 4 2 3 |
Yes |
No |
No |