Information card for entry 7222654
Formula |
Ba Mg2 Si2 |
Calculated formula |
Ba Mg2 Si2 |
Title of publication |
Neue Vertreter des Th Cr2 Si2 -Typs und dessen Verwandtschaft zum Anti-PbFCl-Gitter |
Authors of publication |
Eisenmann, B.; Winter, J.; Mueller, W.; May, N.; Schaefer, H.; Weiss, A.; Ziegleder, G. |
Journal of publication |
Zeitschrift fuer Naturforschung, Teil B. Anorganische Chemie, Organische Chemie (2,1947-32,1977) |
Year of publication |
1970 |
Journal volume |
25 |
Pages of publication |
1350 - 1352 |
a |
4.65 Å |
b |
4.65 Å |
c |
11.09 Å |
α |
90° |
β |
90° |
γ |
90° |
Cell volume |
239.794 Å3 |
Number of distinct elements |
3 |
Space group number |
139 |
Hermann-Mauguin space group symbol |
I 4/m m m |
Hall space group symbol |
-I 4 2 |
Yes |
No |
No |