Information card for entry 7222802
Chemical name |
Li Ba (Co F6) |
Formula |
Ba Co F6 Li |
Calculated formula |
Ba Co F6 Li |
Title of publication |
Zur Rutilverwandschaft: Ueber neue Fluoride des Typs Li M(II) M(III) F6 mit M(III) = Co,Ni und M(II) = Mg, Ca, Sr, Ba, Ni, Cu, Zn, Cd |
Authors of publication |
Fleischer, T.; Hoppe, R. |
Journal of publication |
Zeitschrift fuer Naturforschung, Teil B. Anorganische Chemie, Organische Chemie (33,1978-41,1986) |
Year of publication |
1982 |
Journal volume |
37 |
Pages of publication |
988 - 994 |
a |
5.5056 Å |
b |
10.263 Å |
c |
8.4379 Å |
α |
90° |
β |
90.99° |
γ |
90° |
Cell volume |
476.704 Å3 |
Number of distinct elements |
4 |
Space group number |
14 |
Hermann-Mauguin space group symbol |
P 1 21/c 1 |
Hall space group symbol |
-P 2ybc |
Yes |
No |
No |