Information card for entry 7222841
Formula |
K8 Si46 |
Calculated formula |
K8 Si46 |
Title of publication |
Eine Kaefigstruktur als gemeinsames Bauprinzip der Verbindungen K8 E46 (E = Si, Ge, Sn) |
Authors of publication |
Gallmeier, J.; Schaefer, H.; Weiss, A. |
Journal of publication |
Zeitschrift fuer Naturforschung, Teil B. Anorganische Chemie, Organische Chemie (2,1947-32,1977) |
Year of publication |
1969 |
Journal volume |
24 |
Pages of publication |
665 - 667 |
a |
10.3 Å |
b |
10.3 Å |
c |
10.3 Å |
α |
90° |
β |
90° |
γ |
90° |
Cell volume |
1092.73 Å3 |
Number of distinct elements |
2 |
Space group number |
223 |
Hermann-Mauguin space group symbol |
P m -3 n |
Hall space group symbol |
-P 4n 2 3 |
Yes |
No |
No |