Information card for entry 7222998
Formula | C40 H30 Ag3 Co I5 N8 |
Calculated formula | C40 H30 Ag3 Co I5 N8 |
Title of publication | Hierarchical symmetry transfer and flexible charge matching in five [M(phen)3]2+directed iodoargentates with 1 to 3D frameworks |
Authors of publication | Yu, Tanlai; Fu, Yangbo; Wang, Yilin; Hao, Pengfei; Shen, Junju; Fu, Yunlong |
Journal of publication | CrystEngComm |
Year of publication | 2015 |
Journal volume | 17 |
Journal issue | 45 |
Pages of publication | 8752 |
a | 15.3138 ± 0.0007 Å |
b | 23.0323 ± 0.0006 Å |
c | 14.3495 ± 0.0006 Å |
α | 90° |
β | 115.858 ± 0.005° |
γ | 90° |
Cell volume | 4554.5 ± 0.4 Å3 |
Cell temperature | 293 ± 2 K |
Ambient diffraction temperature | 293 ± 2 K |
Number of distinct elements | 6 |
Space group number | 14 |
Hermann-Mauguin space group symbol | P 1 21/c 1 |
Hall space group symbol | -P 2ybc |
Residual factor for all reflections | 0.0779 |
Residual factor for significantly intense reflections | 0.0504 |
Weighted residual factors for significantly intense reflections | 0.1041 |
Weighted residual factors for all reflections included in the refinement | 0.118 |
Goodness-of-fit parameter for all reflections included in the refinement | 1.044 |
Diffraction radiation wavelength | 0.71073 Å |
Diffraction radiation type | MoKα |