Information card for entry 7223004
Formula | C72 H78 Ag14 Co2 I17 N12 O15 |
Calculated formula | C72 H48 Ag14 Co2 I17 N12 |
Title of publication | Hierarchical symmetry transfer and flexible charge matching in five [M(phen)3]2+directed iodoargentates with 1 to 3D frameworks |
Authors of publication | Yu, Tanlai; Fu, Yangbo; Wang, Yilin; Hao, Pengfei; Shen, Junju; Fu, Yunlong |
Journal of publication | CrystEngComm |
Year of publication | 2015 |
Journal volume | 17 |
Journal issue | 45 |
Pages of publication | 8752 |
a | 22.8119 ± 0.0003 Å |
b | 22.8119 ± 0.0003 Å |
c | 22.8119 ± 0.0003 Å |
α | 90° |
β | 90° |
γ | 90° |
Cell volume | 11870.9 ± 0.3 Å3 |
Cell temperature | 293 ± 2 K |
Ambient diffraction temperature | 293 ± 2 K |
Number of distinct elements | 7 |
Space group number | 199 |
Hermann-Mauguin space group symbol | I 21 3 |
Hall space group symbol | I 2b 2c 3 |
Residual factor for all reflections | 0.1064 |
Residual factor for significantly intense reflections | 0.074 |
Weighted residual factors for significantly intense reflections | 0.2075 |
Weighted residual factors for all reflections included in the refinement | 0.2366 |
Goodness-of-fit parameter for all reflections included in the refinement | 1.103 |
Diffraction radiation wavelength | 0.71073 Å |
Diffraction radiation type | MoKα |