Information card for entry 7223011
Formula | C29 H25 Cd N3 O6 |
Calculated formula | C29 H23 Cd N3 O6 |
Title of publication | N-donor ligands enhancing luminescence properties of seven Zn/Cd(ii) MOFs based on a large rigid π-conjugated carboxylate ligand |
Authors of publication | Ye, Run-Ping; Zhang, Xin; Zhai, Ji-Quan; Qin, Ye-Yan; Zhang, Lei; Yao, Yuan-Gen; Zhang, Jian |
Journal of publication | CrystEngComm |
Year of publication | 2015 |
Journal volume | 17 |
Journal issue | 47 |
Pages of publication | 9155 |
a | 10.1604 ± 0.0006 Å |
b | 11.2134 ± 0.0006 Å |
c | 12.1942 ± 0.0007 Å |
α | 102.647 ± 0.005° |
β | 95.448 ± 0.004° |
γ | 107.156 ± 0.005° |
Cell volume | 1276.19 ± 0.14 Å3 |
Cell temperature | 293 ± 2 K |
Ambient diffraction temperature | 293 ± 2 K |
Number of distinct elements | 5 |
Space group number | 2 |
Hermann-Mauguin space group symbol | P -1 |
Hall space group symbol | -P 1 |
Residual factor for all reflections | 0.0551 |
Residual factor for significantly intense reflections | 0.0477 |
Weighted residual factors for significantly intense reflections | 0.1242 |
Weighted residual factors for all reflections included in the refinement | 0.1309 |
Goodness-of-fit parameter for all reflections included in the refinement | 1.075 |
Diffraction radiation wavelength | 0.71073 Å |
Diffraction radiation type | MoKα |