Information card for entry 7223046
Common name | nitro-pentaammine-Co(III)-dibromide |
Chemical name | nitro-pentaammine-Co(III)-dibromide |
Formula | Br2 Co H15 N6 O2 |
Calculated formula | Br2 Co H15 N6 O2 |
Title of publication | A single-crystal to single-crystal phase transition in [Co(NH3)5NO2]Br2at high pressure: a step towards understanding linkage photo-isomerisation |
Authors of publication | Zakharov, B. A.; Marchuk, A. S.; Boldyreva, E. V. |
Journal of publication | CrystEngComm |
Year of publication | 2015 |
Journal volume | 17 |
Journal issue | 46 |
Pages of publication | 8812 |
a | 10.6023 ± 0.0005 Å |
b | 7.5308 ± 0.0007 Å |
c | 10.6049 ± 0.0004 Å |
α | 90° |
β | 93.439 ± 0.004° |
γ | 90° |
Cell volume | 845.21 ± 0.09 Å3 |
Cell temperature | 295 ± 2 K |
Ambient diffraction temperature | 295 ± 2 K |
Ambient diffracton pressure | 4800000 kPa |
Number of distinct elements | 5 |
Space group number | 15 |
Hermann-Mauguin space group symbol | C 1 2/c 1 |
Hall space group symbol | -C 2yc |
Residual factor for all reflections | 0.0273 |
Residual factor for significantly intense reflections | 0.0252 |
Weighted residual factors for significantly intense reflections | 0.0586 |
Weighted residual factors for all reflections included in the refinement | 0.0603 |
Goodness-of-fit parameter for all reflections included in the refinement | 1.07 |
Diffraction radiation wavelength | 0.71073 Å |
Diffraction radiation type | MoKα |