Information card for entry 7223057
Formula | C56 H61 Bi9 N11 O43.5 |
Calculated formula | C56 H65 Bi9 N11 O43.5 |
Title of publication | Synthesis, crystal structure and biological properties of a bismuth(III) Schiff-base complex |
Authors of publication | Li, Chuan-Hua; Jiang, Jian-Hong; Li, Xu; Tao, Li-Ming; Xiao, Sheng-Xiong; Gu, Hui-Wen; Zhang, Hui; Jiang, Chao; Xie, Jin-Qi; Peng, Meng-Na; Pan, Lan-Lan; Xia, Xian-Ming; Li, Qiang-Guo |
Journal of publication | RSC Adv. |
Year of publication | 2015 |
a | 14.9741 ± 0.0015 Å |
b | 16.89 ± 0.0017 Å |
c | 18.5248 ± 0.0019 Å |
α | 80.769 ± 0.002° |
β | 84.451 ± 0.002° |
γ | 71.208 ± 0.002° |
Cell volume | 4372.9 ± 0.8 Å3 |
Cell temperature | 173 ± 2 K |
Ambient diffraction temperature | 173 ± 2 K |
Number of distinct elements | 5 |
Space group number | 2 |
Hermann-Mauguin space group symbol | P -1 |
Hall space group symbol | -P 1 |
Residual factor for all reflections | 0.0686 |
Residual factor for significantly intense reflections | 0.0458 |
Weighted residual factors for significantly intense reflections | 0.1377 |
Weighted residual factors for all reflections included in the refinement | 0.1555 |
Goodness-of-fit parameter for all reflections included in the refinement | 1.032 |
Diffraction radiation wavelength | 0.71073 Å |
Diffraction radiation type | MoKα |