Information card for entry 7223069
Formula
C30 H22 Au F5 N2 O
Calculated formula
C30 H22 Au F5 N2 O
Title of publication
Carbazole-Based Gold(I) Complexes with Alkyl Chains of Different Lengths: Tunable Solid-State Fluorescence, Aggregation-Induced Emission (AIE), and Reversible Mechanochromism Characteristics
Authors of publication
chen, zhao; yang, lan; Hu, Yuxuan; Wu, Di; Yin, Jun; Yu, Guang-Ao; Liu, Shenghua
Journal of publication
RSC Adv.
Year of publication
2015
a
18.208 ± 0.004 Å
b
17.298 ± 0.003 Å
c
16.458 ± 0.003 Å
α
90°
β
99.525 ± 0.003°
γ
90°
Cell volume
5112.2 ± 1.7 Å3
Cell temperature
298 ± 2 K
Ambient diffraction temperature
298 ± 2 K
Number of distinct elements
6
Space group number
15
Hermann-Mauguin space group symbol
C 1 2/c 1
Hall space group symbol
-C 2yc
Residual factor for all reflections
0.081
Residual factor for significantly intense reflections
0.061
Weighted residual factors for significantly intense reflections
0.1676
Weighted residual factors for all reflections included in the refinement
0.1871
Goodness-of-fit parameter for all reflections included in the refinement
1.051
Diffraction radiation wavelength
0.71073 Å
Diffraction radiation type
MoKα
Yes
No
No