Information card for entry 7223113
Formula | C4 H6 Ge2 K8 Na4 Nd2 O101 W22 |
Calculated formula | C4 H6 Ge2 K8 Na4 Nd2 O101 W22 |
SMILES | C1(=[O][Nd]2345([O]=[W]678(O[W]9%10%11(=O)O[W]%12%13%14(=O)O[W]%15%16(=O)(O9)O[W]9(=O)(O[W]%17%18(O%15)(=O)O[W]%15%19(O%13)(=O)O[W]%13%20(O%12)(=O)O[W]%12(O%10)(=O)(O6)[O]6%13[Ge]([O]%11%14%16)([O]79)[O]%18%19[W](=O)(O%17)(O%15)(O[W]6(O%20)(O%12)(=O)=[O]4)=[O]3)(=[O]2)O8)=O)([OH2])[O]1[Nd]1234([O]=[W]678(O[W]9%10%11(=O)O[W]%12%13%14(=O)O[W]%15%16(=O)(O9)O[W]9(=O)(O[W]%17%18(O%15)(=O)O[W]%15%19(O%13)(=O)O[W]%13%20(O%12)(=O)O[W]%12(O%10)(=O)(O6)[O]6%13[Ge]([O]%11%14%16)([O]79)[O]%18%19[W](=O)(O%17)(O%15)(O[W]6(O%20)(O%12)(=O)=[O]3)=[O]2)(=[O]1)O8)=O)([OH2])[O]=C(C)[O]54)C.O.O.O.O.O.O.O.O.O.O.O.O.[Na+].[Na+].[K+].[K+].[K+].[K+].[Na+].O.O.O.O.O.[K+].[K+].[K+].[K+].[Na+] |
Title of publication | Syntheses, crystal structure, electrochemistry and luminescence properties of lanthano-germanotungstates |
Authors of publication | Gupta, Rakesh; Hussain, Firasat; Behera, Jogendra Nath; Bossoh, Amoassi Martin; Mbomekalle, Israel Martyr; Oliveira, Pedro Almeida-de |
Journal of publication | RSC Adv. |
Year of publication | 2015 |
a | 20.079 ± 0.0007 Å |
b | 12.5625 ± 0.0004 Å |
c | 21.1756 ± 0.0007 Å |
α | 90° |
β | 111.01 ± 0.004° |
γ | 90° |
Cell volume | 4986.3 ± 0.3 Å3 |
Cell temperature | 298 ± 2 K |
Ambient diffraction temperature | 298.15 K |
Number of distinct elements | 8 |
Space group number | 14 |
Hermann-Mauguin space group symbol | P 1 21/c 1 |
Hall space group symbol | -P 2ybc |
Residual factor for all reflections | 0.0991 |
Residual factor for significantly intense reflections | 0.0625 |
Weighted residual factors for significantly intense reflections | 0.1132 |
Weighted residual factors for all reflections included in the refinement | 0.1292 |
Goodness-of-fit parameter for all reflections included in the refinement | 1.067 |
Diffraction radiation wavelength | 0.71073 Å |
Diffraction radiation type | MoKα |