Information card for entry 7223189
Chemical name | Triflusal-valpromide cocrystal |
Formula | C18 H24 F3 N O5 |
Calculated formula | C18 H24 F3 N O5 |
Title of publication | Novel pharmaceutical cocrystals of triflusal: crystal engineering and physicochemical characterization |
Authors of publication | Aitipamula, Srinivasulu; Mapp, Lucy K.; Wong, Annie B. H.; Chow, Pui Shan; Tan, Reginald B. H. |
Journal of publication | CrystEngComm |
Year of publication | 2015 |
Journal volume | 17 |
Journal issue | 48 |
Pages of publication | 9323 |
a | 19.8545 ± 0.0008 Å |
b | 5.06409 ± 0.00017 Å |
c | 21.853 ± 0.0011 Å |
α | 90° |
β | 114.362 ± 0.006° |
γ | 90° |
Cell volume | 2001.56 ± 0.17 Å3 |
Cell temperature | 100 K |
Ambient diffraction temperature | 100 K |
Number of distinct elements | 5 |
Space group number | 14 |
Hermann-Mauguin space group symbol | P 1 21/c 1 |
Hall space group symbol | -P 2ybc |
Residual factor for all reflections | 0.0557 |
Residual factor for significantly intense reflections | 0.0456 |
Weighted residual factors for significantly intense reflections | 0.1106 |
Weighted residual factors for all reflections included in the refinement | 0.1167 |
Goodness-of-fit parameter for all reflections included in the refinement | 1.042 |
Diffraction radiation probe | x-ray |
Diffraction radiation wavelength | 0.71073 Å |
Diffraction radiation type | MoKα |