Information card for entry 7223192
Formula | C10 H20 Mg4 N2 O22 P2 |
Calculated formula | C10 H20 Mg4 N2 O22 P2 |
Title of publication | Solvent-free synthesis of new magnesium phosphate‒oxalates displaying diverse framework topologies |
Authors of publication | Zhang, Wei; Kang, Maoping; Yang, Meng; Luo, Daibing; Lin, Zhien |
Journal of publication | CrystEngComm |
Year of publication | 2015 |
Journal volume | 17 |
Journal issue | 48 |
Pages of publication | 9296 |
a | 7.6627 ± 0.0003 Å |
b | 7.8432 ± 0.0003 Å |
c | 9.7695 ± 0.0003 Å |
α | 72.092 ± 0.003° |
β | 83.275 ± 0.003° |
γ | 84.998 ± 0.003° |
Cell volume | 554.04 ± 0.04 Å3 |
Cell temperature | 293 K |
Ambient diffraction temperature | 293 K |
Number of distinct elements | 6 |
Space group number | 2 |
Hermann-Mauguin space group symbol | P -1 |
Hall space group symbol | -P 1 |
Residual factor for all reflections | 0.0419 |
Residual factor for significantly intense reflections | 0.0416 |
Weighted residual factors for significantly intense reflections | 0.1107 |
Weighted residual factors for all reflections included in the refinement | 0.1112 |
Goodness-of-fit parameter for all reflections included in the refinement | 1.114 |
Diffraction radiation probe | x-ray |
Diffraction radiation wavelength | 1.54184 Å |
Diffraction radiation type | CuKα |