Information card for entry 7223278
Formula | C28 H52 Cu I6 N8 S2 |
Calculated formula | C28 H52 Cu I6 N8 S2 |
SMILES | I[I-]I.[Cu]12([S]=C3N(CCN3CCCC)C3=[N]1CCN3CCCC)[S]=C1N(CCN1CCCC)C1=[N]2CCN1CCCC.I[I-]I |
Title of publication | Chemistry of heterocyclic-2-thiones: in situ generated 1-(4,5-dihydro-3-alkyl-imidazolidin-2-yl)-3-alkyl-imidazolidine-2-thione and triiodide form novel mixed valent CuI-II /CuII complexes |
Authors of publication | Lobana, Tarlok Singh; Sultana, Razia; Castineiras, Alfonso |
Journal of publication | RSC Adv. |
Year of publication | 2015 |
a | 8.3323 ± 0.0004 Å |
b | 11.8411 ± 0.0005 Å |
c | 12.396 ± 0.0006 Å |
α | 65.562 ± 0.002° |
β | 81.02 ± 0.002° |
γ | 74.418 ± 0.002° |
Cell volume | 1071.13 ± 0.09 Å3 |
Cell temperature | 100 ± 2 K |
Ambient diffraction temperature | 100 ± 2 K |
Number of distinct elements | 6 |
Space group number | 2 |
Hermann-Mauguin space group symbol | P -1 |
Hall space group symbol | -P 1 |
Residual factor for all reflections | 0.0353 |
Residual factor for significantly intense reflections | 0.0255 |
Weighted residual factors for significantly intense reflections | 0.0512 |
Weighted residual factors for all reflections included in the refinement | 0.0556 |
Goodness-of-fit parameter for all reflections included in the refinement | 1.075 |
Diffraction radiation wavelength | 0.71073 Å |
Diffraction radiation type | MoKα |