Information card for entry 7223357
Formula | C26 H23 F3 I3 N3 O2 |
Calculated formula | C26 H23 F3 I3 N3 O2 |
SMILES | c1(c(c(c(c(c1F)I)F)I)F)I.c1cc(ccn1)c1nnc(c2ccc(cc2)OCCCCCCC)o1 |
Title of publication | Extending the halogen-bonded supramolecular synthon concept to 1,3,4-oxadiazole derivatives |
Authors of publication | Hidalgo, Paulina I.; Leal, Sergio; Jiménez, Claudio A.; Vöhringer-Martinez, Esteban; Herrera, Bárbara; Pasán, Jorge; Ruiz-Pérez, Catalina; Bruce, Duncan W. |
Journal of publication | CrystEngComm |
Year of publication | 2016 |
Journal volume | 18 |
Journal issue | 1 |
Pages of publication | 42 |
a | 10.0662 ± 0.0002 Å |
b | 14.4987 ± 0.0003 Å |
c | 20.6364 ± 0.0005 Å |
α | 82.22 ± 0.002° |
β | 81.567 ± 0.002° |
γ | 89.177 ± 0.002° |
Cell volume | 2951.78 ± 0.11 Å3 |
Cell temperature | 293 ± 2 K |
Ambient diffraction temperature | 293 ± 2 K |
Number of distinct elements | 6 |
Space group number | 2 |
Hermann-Mauguin space group symbol | P -1 |
Hall space group symbol | -P 1 |
Residual factor for all reflections | 0.0684 |
Residual factor for significantly intense reflections | 0.0577 |
Weighted residual factors for significantly intense reflections | 0.1536 |
Weighted residual factors for all reflections included in the refinement | 0.1694 |
Goodness-of-fit parameter for all reflections included in the refinement | 1.024 |
Diffraction radiation wavelength | 1.54184 Å |
Diffraction radiation type | CuKα |