Information card for entry 7223381
Formula | C44 H86 Cu4 N4 O37 Zr6 |
Calculated formula | C44 H86 Cu4 N4 O37 Zr6 |
Title of publication | Fabrication of CuO-1.5ZrO2 composite thin film, from heteronuclear molecular complex and its electrocatalytic activity towards methanol oxidation |
Authors of publication | Mazhar, Muhammad; Ehsan, Muhammad Ali; Abbas, Hakeem; Khaledi, Hamid; Shahid, Muhammad Mehmood; Pandikumar, Alagarsamy; Huang, Nay Ming |
Journal of publication | RSC Adv. |
Year of publication | 2015 |
a | 12.0851 ± 0.0002 Å |
b | 13.2867 ± 0.0003 Å |
c | 23.8841 ± 0.0004 Å |
α | 77.826 ± 0.001° |
β | 79.391 ± 0.001° |
γ | 70.957 ± 0.001° |
Cell volume | 3516 ± 0.12 Å3 |
Cell temperature | 133 ± 2 K |
Ambient diffraction temperature | 133 ± 2 K |
Number of distinct elements | 6 |
Space group number | 2 |
Hermann-Mauguin space group symbol | P -1 |
Hall space group symbol | -P 1 |
Residual factor for all reflections | 0.0613 |
Residual factor for significantly intense reflections | 0.039 |
Weighted residual factors for significantly intense reflections | 0.082 |
Weighted residual factors for all reflections included in the refinement | 0.0913 |
Goodness-of-fit parameter for all reflections included in the refinement | 1.032 |
Diffraction radiation wavelength | 0.71073 Å |
Diffraction radiation type | MoKα |