Information card for entry 7223393
Chemical name | (2-oxy-4-methoxybenzaldehyde benzoylhydrazonato-O,N,O) (2-oxy-4-methoxybenzaldehyde benzoylhydrazidato-O,N,O) cobalt(III) methanol solvate (1/1) |
Formula | C31 H25 Co N4 O7 |
Calculated formula | C31 H25 Co N4 O7 |
Title of publication | Cobalt(III) complexes with tridentate hydrazone ligands: protonation state and hydrogen bonds competition |
Authors of publication | Vrdoljak, Visnja; Pavlović, Gordana; Hrenar, Tomica; Rubčić, Mirta; Siega, Patrizia; Dreos, Renata; Cindric, Marina |
Journal of publication | RSC Adv. |
Year of publication | 2015 |
a | 21.903 ± 0.004 Å |
b | 10.291 ± 0.0008 Å |
c | 12.5225 ± 0.0008 Å |
α | 90° |
β | 98.436 ± 0.01° |
γ | 90° |
Cell volume | 2792.1 ± 0.6 Å3 |
Cell temperature | 296 ± 2 K |
Ambient diffraction temperature | 296 ± 2 K |
Number of distinct elements | 5 |
Space group number | 15 |
Hermann-Mauguin space group symbol | C 1 2/c 1 |
Hall space group symbol | -C 2yc |
Residual factor for all reflections | 0.0635 |
Residual factor for significantly intense reflections | 0.0502 |
Weighted residual factors for significantly intense reflections | 0.1184 |
Weighted residual factors for all reflections included in the refinement | 0.1248 |
Goodness-of-fit parameter for all reflections included in the refinement | 1.081 |
Diffraction radiation wavelength | 0.71073 Å |
Diffraction radiation type | MoKα |