Information card for entry 7223421
Chemical name | 2-(3,6-diphenyl-7H-[1,2,4]triazolo[3,4-b][1,3,4]thiadiazin-7-ylidene)-1-phenylethanone (24) |
Formula | C24 H16 N4 O S |
Calculated formula | C24 H16 N4 O S |
SMILES | S1\C(C(=Nn2c1nnc2c1ccccc1)c1ccccc1)=C/C(=O)c1ccccc1 |
Title of publication | One step synthesis of highly functionalized thiazolo[3,2- b][1,2,4]triazole, triazolo[1,5-a]pyrimidine and triazolo[3,4- b][1,3,4]thiadiazine† |
Authors of publication | Shah, Tariq A.; Ahmad, Zubair; Mir, Niyaz A.; Muneer, Mohammad; Ahmad, Musheer; Rath, Nigam P. |
Journal of publication | RSC Adv. |
Year of publication | 2015 |
a | 6.992 Å |
b | 14.617 Å |
c | 19.051 Å |
α | 90° |
β | 95.5° |
γ | 90° |
Cell volume | 1938.09 Å3 |
Cell temperature | 150 ± 2 K |
Ambient diffraction temperature | 150 ± 2 K |
Number of distinct elements | 5 |
Space group number | 14 |
Hermann-Mauguin space group symbol | P 1 21/n 1 |
Hall space group symbol | -P 2yn |
Residual factor for all reflections | 0.0642 |
Residual factor for significantly intense reflections | 0.0541 |
Weighted residual factors for significantly intense reflections | 0.152 |
Weighted residual factors for all reflections included in the refinement | 0.1726 |
Goodness-of-fit parameter for all reflections included in the refinement | 1.173 |
Diffraction radiation wavelength | 0.71073 Å |
Diffraction radiation type | MoKα |