Information card for entry 7223448
Formula | C120 H114 N16 O22 Yb2 |
Calculated formula | C120 H114 N16 O22 Yb2 |
SMILES | c1ccc2c3[n]1[Yb]14567([n]8cccc(c38)cc2)([O]=C(O1)CCCc1c[nH]c2ccccc12)[O]=C([O]4[Yb]123([O]=C(O5)CCCc5c[nH]c4ccccc54)([n]4cccc5ccc8ccc[n]1c8c45)([O]=C(O2)CCCc1c[nH]c2ccccc12)([O]=C([O]63)CCCc1c[nH]c2ccccc12)OC(=[O]7)CCCc1c[nH]c2ccccc12)CCCc1c[nH]c2c1cccc2.n1c2c3[nH+]cccc3ccc2ccc1.N(=O)(=O)[O-].O.O.n1cccc2ccc3ccc[nH+]c3c12.N(=O)(=O)[O-].O.O |
Title of publication | Synthesis, crystal structure, fluorescence and antimicrobial activity of a series of rare-earth complexes based on indolebutyric acid |
Authors of publication | Wang, Zhi-Nan; Xu, Xue-Ting; Lv, Xiao; Bai, Feng-Ying; Liu, Shu-Qing; Xing, Yong-Heng |
Journal of publication | RSC Adv. |
Year of publication | 2015 |
Journal volume | 5 |
Journal issue | 126 |
Pages of publication | 104263 |
a | 13.414 ± 0.003 Å |
b | 14.31 ± 0.003 Å |
c | 16.704 ± 0.003 Å |
α | 80.06 ± 0.03° |
β | 71.24 ± 0.03° |
γ | 64.17 ± 0.03° |
Cell volume | 2730.7 ± 1.3 Å3 |
Cell temperature | 293 ± 2 K |
Ambient diffraction temperature | 293 ± 2 K |
Number of distinct elements | 5 |
Space group number | 2 |
Hermann-Mauguin space group symbol | P -1 |
Hall space group symbol | -P 1 |
Residual factor for all reflections | 0.0305 |
Residual factor for significantly intense reflections | 0.0264 |
Weighted residual factors for significantly intense reflections | 0.0808 |
Weighted residual factors for all reflections included in the refinement | 0.0893 |
Goodness-of-fit parameter for all reflections included in the refinement | 1.07 |
Diffraction radiation wavelength | 0.71073 Å |
Diffraction radiation type | MoKα |