Information card for entry 7223450
Formula | C96 H88 Eu2 N10 O12 |
Calculated formula | C96 H88 Eu2 N10 O12 |
SMILES | [nH]1cc(CCCC2=[O][Eu]34567(O2)([n]2cccc8ccc9ccc[n]3c9c28)[O]=C([O]4[Eu]234([n]8cccc9ccc%10ccc[n]2c%10c89)([O]=C(O3)CCCc2c[nH]c3ccccc23)([O]=C([O]54)CCCc2c[nH]c3ccccc23)([O]=C(O7)CCCc2c[nH]c3ccccc23)OC(=[O]6)CCCc2c[nH]c3ccccc23)CCCc2c[nH]c3ccccc23)c2c1cccc2 |
Title of publication | Synthesis, crystal structure, fluorescence and antimicrobial activity of a series of rare-earth complexes based on indolebutyric acid |
Authors of publication | Wang, Zhi-Nan; Xu, Xue-Ting; Lv, Xiao; Bai, Feng-Ying; Liu, Shu-Qing; Xing, Yong-Heng |
Journal of publication | RSC Adv. |
Year of publication | 2015 |
Journal volume | 5 |
Journal issue | 126 |
Pages of publication | 104263 |
a | 13.811 ± 0.003 Å |
b | 18.43 ± 0.004 Å |
c | 17.214 ± 0.003 Å |
α | 90° |
β | 106.47 ± 0.03° |
γ | 90° |
Cell volume | 4201.8 ± 1.6 Å3 |
Cell temperature | 293 ± 2 K |
Ambient diffraction temperature | 293 ± 2 K |
Number of distinct elements | 5 |
Space group number | 14 |
Hermann-Mauguin space group symbol | P 1 21/n 1 |
Hall space group symbol | -P 2yn |
Residual factor for all reflections | 0.089 |
Residual factor for significantly intense reflections | 0.0485 |
Weighted residual factors for significantly intense reflections | 0.0745 |
Weighted residual factors for all reflections included in the refinement | 0.0833 |
Goodness-of-fit parameter for all reflections included in the refinement | 1.013 |
Diffraction radiation wavelength | 0.71073 Å |
Diffraction radiation type | MoKα |