Information card for entry 7223454
Formula
C34 H20 Gd2 N6 O13
Calculated formula
C34 H20 Gd2 N6 O13
Title of publication
3D lanthanide metal organic frameworks constructed from lanthanide formate skeleton and 3,5-bis(4’-carboxy-phenyl)-1,2,4-triazole connector: synthesis, structure and luminescence
Authors of publication
Wang, Shengyan; xu, jianing; Fan, Yong; Jia, Jia; Gao, Lijuan; Sun, Jing; Shan, Liang; Chen, Xiaodong; Wang, Li; Seo, Hyo Jin
Journal of publication
RSC Adv.
Year of publication
2015
a
6.7503 ± 0.0004 Å
b
36.407 ± 0.003 Å
c
13.0761 ± 0.0009 Å
α
90°
β
90°
γ
90°
Cell volume
3213.6 ± 0.4 Å3
Cell temperature
293 ± 2 K
Ambient diffraction temperature
293 ± 2 K
Number of distinct elements
5
Space group number
62
Hermann-Mauguin space group symbol
P n m a
Hall space group symbol
-P 2ac 2n
Residual factor for all reflections
0.0649
Residual factor for significantly intense reflections
0.0456
Weighted residual factors for significantly intense reflections
0.0903
Weighted residual factors for all reflections included in the refinement
0.0959
Goodness-of-fit parameter for all reflections included in the refinement
1.101
Diffraction radiation wavelength
0.71073 Å
Diffraction radiation type
MoKα
Yes
No
No