Information card for entry 7223543
Common name | C15 H24 N4 O13.50 Eu0.12 Gd0.88 |
Formula | C15 H24 Eu0.12 Gd0.88 N4 O13.5 |
Calculated formula | C15 H13 Eu0.12 Gd0.88 N4 O13.5 |
Title of publication | Excitation wavelength-induced color-tunable and white-light emissions in lanthanide(iii) coordination polymers constructed using an environment-dependent luminescent tetrazolate‒dicarboxylate ligand |
Authors of publication | Xiao, Yu; Wang, Shuai-Hua; Zheng, Fa-Kun; Wu, Mei-Feng; Xu, Ju; Liu, Zhi-Fa; Chen, Jun; Li, Rong; Guo, Guo-Cong |
Journal of publication | CrystEngComm |
Year of publication | 2016 |
Journal volume | 18 |
Journal issue | 5 |
Pages of publication | 721 |
a | 9.117 ± 0.002 Å |
b | 9.474 ± 0.002 Å |
c | 13.956 ± 0.003 Å |
α | 95.423 ± 0.005° |
β | 91.643 ± 0.004° |
γ | 107.538 ± 0.005° |
Cell volume | 1142.2 ± 0.4 Å3 |
Cell temperature | 293 ± 2 K |
Ambient diffraction temperature | 293 ± 2 K |
Number of distinct elements | 6 |
Space group number | 2 |
Hermann-Mauguin space group symbol | P -1 |
Hall space group symbol | -P 1 |
Residual factor for all reflections | 0.0239 |
Residual factor for significantly intense reflections | 0.0216 |
Weighted residual factors for significantly intense reflections | 0.0619 |
Weighted residual factors for all reflections included in the refinement | 0.0633 |
Goodness-of-fit parameter for all reflections included in the refinement | 1.044 |
Diffraction radiation wavelength | 0.71073 Å |
Diffraction radiation type | MoKα |