Information card for entry 7223571
Formula | C33 H24 N6 O8 Zn |
Calculated formula | C33 H24 N6 O8 Zn |
Title of publication | Syntheses, structures and luminescence of a series of coordination polymers constructed with 4-substituted 1,2,4-triazole and biscarboxylate co-ligands |
Authors of publication | Han, Shan-Shan; Shi, Lu-Lu; Li, Ke; Zhao, Shan; Li, Bao-Long; Wu, Bing |
Journal of publication | RSC Adv. |
Year of publication | 2015 |
Journal volume | 5 |
Journal issue | 129 |
Pages of publication | 107166 |
a | 9.6296 ± 0.0015 Å |
b | 12.867 ± 0.0016 Å |
c | 13.3979 ± 0.0017 Å |
α | 71.781 ± 0.013° |
β | 75.362 ± 0.015° |
γ | 74.395 ± 0.015° |
Cell volume | 1492.7 ± 0.4 Å3 |
Cell temperature | 293 ± 2 K |
Ambient diffraction temperature | 293 ± 2 K |
Number of distinct elements | 5 |
Space group number | 2 |
Hermann-Mauguin space group symbol | P -1 |
Hall space group symbol | -P 1 |
Residual factor for all reflections | 0.0937 |
Residual factor for significantly intense reflections | 0.065 |
Weighted residual factors for significantly intense reflections | 0.1363 |
Weighted residual factors for all reflections included in the refinement | 0.1515 |
Goodness-of-fit parameter for all reflections included in the refinement | 1.056 |
Diffraction radiation wavelength | 0.7107 Å |
Diffraction radiation type | MoKα |