Information card for entry 7223585
Formula | C30 H42 Ag F6 N4 O3 P S4 |
Calculated formula | C30 H36 Ag F6 N4 O3 P S4 |
Title of publication | Molecular tectonics: dimensionality and geometry control of silver coordination networks based on pyrazolyl appended thiacalixarenes |
Authors of publication | Ovsyannikov, A. S.; Noamane, M. H.; Abidi, R.; Ferlay, S.; Solovieva, S. E.; Antipin, I. S.; Konovalov, A. I.; Kyritsakas, N.; Hosseini, M. W. |
Journal of publication | CrystEngComm |
Year of publication | 2016 |
Journal volume | 18 |
Journal issue | 5 |
Pages of publication | 691 |
a | 24.2538 ± 0.0009 Å |
b | 24.2538 ± 0.0009 Å |
c | 13.6809 ± 0.0005 Å |
α | 90° |
β | 90° |
γ | 90° |
Cell volume | 8047.7 ± 0.5 Å3 |
Cell temperature | 173 ± 2 K |
Ambient diffraction temperature | 173 ± 2 K |
Number of distinct elements | 8 |
Space group number | 122 |
Hermann-Mauguin space group symbol | I -4 2 d |
Hall space group symbol | I -4 2bw |
Residual factor for all reflections | 0.0535 |
Residual factor for significantly intense reflections | 0.0495 |
Weighted residual factors for significantly intense reflections | 0.1563 |
Weighted residual factors for all reflections included in the refinement | 0.1644 |
Goodness-of-fit parameter for all reflections included in the refinement | 1.009 |
Diffraction radiation wavelength | 0.71073 Å |
Diffraction radiation type | MoKα |