Information card for entry 7223623
Formula | C38 H32 Co N4 O12 |
Calculated formula | C38 H32 Co N4 O12 |
Title of publication | A series of coordination polymers with tuned terphenyl tetracarboxylates and bis-pyridyl ligands with different flexibilities manifesting fluorescence properties and photocatalytic activities |
Authors of publication | Mu, Bao; Huang, Ru-Dan |
Journal of publication | CrystEngComm |
Year of publication | 2016 |
Journal volume | 18 |
Journal issue | 6 |
Pages of publication | 986 |
a | 6.615 ± 0.0005 Å |
b | 10.2951 ± 0.0009 Å |
c | 14.1409 ± 0.0012 Å |
α | 111.3 ± 0.002° |
β | 92.619 ± 0.001° |
γ | 96.173 ± 0.001° |
Cell volume | 888.3 ± 0.13 Å3 |
Cell temperature | 298 ± 2 K |
Ambient diffraction temperature | 298.15 K |
Number of distinct elements | 5 |
Space group number | 2 |
Hermann-Mauguin space group symbol | P -1 |
Hall space group symbol | -P 1 |
Residual factor for all reflections | 0.0721 |
Residual factor for significantly intense reflections | 0.0531 |
Weighted residual factors for significantly intense reflections | 0.1251 |
Weighted residual factors for all reflections included in the refinement | 0.1368 |
Goodness-of-fit parameter for all reflections included in the refinement | 0.9988 |
Diffraction radiation wavelength | 0.71073 Å |
Diffraction radiation type | MoKα |