Information card for entry 7223650
Formula | C14 H10 Cd2 I4 N8 |
Calculated formula | C14 H10 Cd2 I4 N8 |
Title of publication | A family of Zn(ii)/Cd(ii) halide systems incorporating 5,5′-di(pyridin-2-yl)-3,3′-bi(1,2,4-triazole) |
Authors of publication | Yao, Peng-Fei; Liu, Han-Fu; Huang, Fu-Ping; Feng, Fang-lin; Qin, Xiao-Huan; Huang, Mei-Li; Yu, Qing; Bian, He-Dong |
Journal of publication | CrystEngComm |
Year of publication | 2016 |
Journal volume | 18 |
Journal issue | 6 |
Pages of publication | 938 |
a | 7.5634 ± 0.0004 Å |
b | 10.2048 ± 0.0004 Å |
c | 14.7545 ± 0.0007 Å |
α | 77.097 ± 0.004° |
β | 84.449 ± 0.004° |
γ | 88.279 ± 0.004° |
Cell volume | 1104.79 ± 0.09 Å3 |
Cell temperature | 293 ± 2 K |
Ambient diffraction temperature | 293 ± 2 K |
Number of distinct elements | 5 |
Space group number | 2 |
Hermann-Mauguin space group symbol | P -1 |
Hall space group symbol | -P 1 |
Residual factor for all reflections | 0.0658 |
Residual factor for significantly intense reflections | 0.055 |
Weighted residual factors for significantly intense reflections | 0.1465 |
Weighted residual factors for all reflections included in the refinement | 0.1563 |
Goodness-of-fit parameter for all reflections included in the refinement | 1.044 |
Diffraction radiation wavelength | 0.7107 Å |
Diffraction radiation type | MoKα |