Information card for entry 7223775
Formula | C32 H56 Ag4 N12 O0 |
Calculated formula | C32 H56 Ag4 N12 |
Title of publication | Guest-containing supramolecular isomers of silver(i) 3,5-dialkyl-1,2,4-triazolates: syntheses, structures, and structural transformation behaviours |
Authors of publication | Yang, Xiao; Wang, Yu; Zhou, Hao-Long; Liu, Yi-Jiang; He, Chun-Ting; Lin, Rui-Biao; Zhang, Jie-Peng |
Journal of publication | CrystEngComm |
Year of publication | 2015 |
Journal volume | 17 |
Journal issue | 46 |
Pages of publication | 8843 |
a | 10.37 ± 0.0004 Å |
b | 14.3641 ± 0.0005 Å |
c | 15.3164 ± 0.0006 Å |
α | 89.577 ± 0.001° |
β | 74.198 ± 0.001° |
γ | 69.63 ± 0.001° |
Cell volume | 2048.28 ± 0.13 Å3 |
Cell temperature | 113 ± 2 K |
Ambient diffraction temperature | 113 ± 2 K |
Number of distinct elements | 5 |
Space group number | 2 |
Hermann-Mauguin space group symbol | P -1 |
Hall space group symbol | -P 1 |
Residual factor for all reflections | 0.037 |
Residual factor for significantly intense reflections | 0.0309 |
Weighted residual factors for significantly intense reflections | 0.0747 |
Weighted residual factors for all reflections included in the refinement | 0.0839 |
Goodness-of-fit parameter for all reflections included in the refinement | 1.009 |
Diffraction radiation wavelength | 0.71073 Å |
Diffraction radiation type | MoKα |