Information card for entry 7223790
Chemical name | catena-(bis(m2-chloro)-(acridine)-mercury) |
Formula | C13 H9 Cl2 Hg N |
Calculated formula | C13 H9 Cl2 Hg N |
Title of publication | Structures and trends of one-dimensional halide-bridged polymers of five-coordinate cadmium(ii) and mercury(ii) with benzopyridine and -pyrazine-type N-donor ligands |
Authors of publication | Slabbert, C.; Rademeyer, M. |
Journal of publication | CrystEngComm |
Year of publication | 2015 |
Journal volume | 17 |
Journal issue | 47 |
Pages of publication | 9070 |
a | 17.8278 ± 0.0006 Å |
b | 10.0406 ± 0.0004 Å |
c | 7.1913 ± 0.0002 Å |
α | 90° |
β | 111.792 ± 0.002° |
γ | 90° |
Cell volume | 1195.27 ± 0.07 Å3 |
Cell temperature | 293 ± 2 K |
Ambient diffraction temperature | 293 ± 2 K |
Number of distinct elements | 5 |
Space group number | 15 |
Hermann-Mauguin space group symbol | C 1 2/c 1 |
Hall space group symbol | -C 2yc |
Residual factor for all reflections | 0.0869 |
Residual factor for significantly intense reflections | 0.0745 |
Weighted residual factors for significantly intense reflections | 0.1979 |
Weighted residual factors for all reflections included in the refinement | 0.2099 |
Goodness-of-fit parameter for all reflections included in the refinement | 1.02 |
Diffraction radiation wavelength | 0.71073 Å |
Diffraction radiation type | MoKα |