Information card for entry 7223803
Formula | C13 H19 N3 O |
Calculated formula | C13 H19 N3 O |
Title of publication | Comparative Study of dG Affinity vs.DNA Methylation Modulating Properties of Side Chain Derivatives of Procainamide: Insight into its DNA Hypomethylating Effect |
Authors of publication | Gawade, Rupesh Liladhar; Chakravarty, Debamitra K.; Debgupta, Joyashish; Sangtani, Ekta; Narawade, Santosh; Gonnade, Rajesh G.; Puranik, Vedavati G.; Deobagkar, Deepti D. |
Journal of publication | RSC Adv. |
Year of publication | 2016 |
a | 6.391 ± 0.003 Å |
b | 13.847 ± 0.007 Å |
c | 14.418 ± 0.007 Å |
α | 90° |
β | 90° |
γ | 90° |
Cell volume | 1275.9 ± 1.1 Å3 |
Cell temperature | 296 ± 2 K |
Ambient diffraction temperature | 296 ± 2 K |
Number of distinct elements | 4 |
Space group number | 19 |
Hermann-Mauguin space group symbol | P 21 21 21 |
Hall space group symbol | P 2ac 2ab |
Residual factor for all reflections | 0.1023 |
Residual factor for significantly intense reflections | 0.0532 |
Weighted residual factors for significantly intense reflections | 0.1232 |
Weighted residual factors for all reflections included in the refinement | 0.1493 |
Goodness-of-fit parameter for all reflections included in the refinement | 1.015 |
Diffraction radiation wavelength | 0.71073 Å |
Diffraction radiation type | MoKα |