Information card for entry 7223806
Formula | C14 H21 N3 O |
Calculated formula | C14 H21 N3 O |
SMILES | O=C(NCCN1CCCCC1)c1ccc(N)cc1 |
Title of publication | Comparative Study of dG Affinity vs.DNA Methylation Modulating Properties of Side Chain Derivatives of Procainamide: Insight into its DNA Hypomethylating Effect |
Authors of publication | Gawade, Rupesh Liladhar; Chakravarty, Debamitra K.; Debgupta, Joyashish; Sangtani, Ekta; Narawade, Santosh; Gonnade, Rajesh G.; Puranik, Vedavati G.; Deobagkar, Deepti D. |
Journal of publication | RSC Adv. |
Year of publication | 2016 |
a | 9.624 ± 0.002 Å |
b | 10.246 ± 0.003 Å |
c | 13.768 ± 0.003 Å |
α | 90° |
β | 90° |
γ | 90° |
Cell volume | 1357.6 ± 0.6 Å3 |
Cell temperature | 296 ± 2 K |
Ambient diffraction temperature | 296 ± 2 K |
Number of distinct elements | 4 |
Space group number | 19 |
Hermann-Mauguin space group symbol | P 21 21 21 |
Hall space group symbol | P 2ac 2ab |
Residual factor for all reflections | 0.079 |
Residual factor for significantly intense reflections | 0.0643 |
Weighted residual factors for significantly intense reflections | 0.1486 |
Weighted residual factors for all reflections included in the refinement | 0.1626 |
Goodness-of-fit parameter for all reflections included in the refinement | 1.004 |
Diffraction radiation wavelength | 0.71073 Å |
Diffraction radiation type | MoKα |