Information card for entry 7223862
Formula | C40 H56 Ni4 O16 |
Calculated formula | C40 H56 Ni4 O16 |
SMILES | [Ni]123([O]=Cc4c(O1)ccc(c4)C)([O]1([Ni]45(Oc6c(cc(cc6)C)C=[O]5)([OH]C)[O]2([Ni]25([O]=Cc6c(O2)ccc(c6)C)([OH]C)[O]4([Ni]21(Oc1c(C=[O]2)cc(cc1)C)([O]35C)[OH]C)C)C)C)[OH]C |
Title of publication | Effects of electron donating/withdrawing groups in the 5-substituted-2-hydroxybenzaldehyde on the synthesis of neutral cubanes with a NiII4O4 core: Synthesis, crystal structures and magnetic properties |
Authors of publication | Amiri Rudbari, Hadi; Lloret, Francesc; Khorshidifard, Mahsa; bruno, giuseppe; Julve, Miguel |
Journal of publication | RSC Adv. |
Year of publication | 2016 |
a | 18.262 ± 0.004 Å |
b | 17.467 ± 0.004 Å |
c | 14.722 ± 0.003 Å |
α | 90° |
β | 90.39 ± 0.03° |
γ | 90° |
Cell volume | 4695.9 ± 1.8 Å3 |
Cell temperature | 298 ± 2 K |
Ambient diffraction temperature | 298 ± 2 K |
Number of distinct elements | 4 |
Space group number | 14 |
Hermann-Mauguin space group symbol | P 1 21/c 1 |
Hall space group symbol | -P 2ybc |
Residual factor for all reflections | 0.0571 |
Residual factor for significantly intense reflections | 0.0358 |
Weighted residual factors for significantly intense reflections | 0.0844 |
Weighted residual factors for all reflections included in the refinement | 0.0906 |
Goodness-of-fit parameter for all reflections included in the refinement | 0.92 |
Diffraction radiation wavelength | 0.71073 Å |
Diffraction radiation type | MoKα |