Information card for entry 7223870
Formula | C164.5 H169.5 Co9 N72.5 O28.5 W6 |
Calculated formula | C164.5 H142.5 Co9 N72.5 O28.5 W6 |
Title of publication | The solvent effect on the structural and magnetic features of bidentate ligand-capped {CoII9[WV(CN)8]6} single-molecule magnets |
Authors of publication | Chorazy, Szymon; Hoczek, Anna; Kubicki, Maciej; Tokoro, Hiroko; Ohkoshi, Shin-ichi; Sieklucka, Barbara; Podgajny, Robert |
Journal of publication | CrystEngComm |
Year of publication | 2016 |
Journal volume | 18 |
Journal issue | 9 |
Pages of publication | 1495 |
a | 19.0923 ± 0.0003 Å |
b | 20.3195 ± 0.0004 Å |
c | 31.5482 ± 0.0006 Å |
α | 72.427 ± 0.001° |
β | 77.063 ± 0.001° |
γ | 68.621 ± 0.001° |
Cell volume | 10775.3 ± 0.4 Å3 |
Cell temperature | 100 ± 2 K |
Ambient diffraction temperature | 100 ± 2 K |
Number of distinct elements | 6 |
Space group number | 2 |
Hermann-Mauguin space group symbol | P -1 |
Hall space group symbol | -P 1 |
Residual factor for all reflections | 0.0458 |
Residual factor for significantly intense reflections | 0.0371 |
Weighted residual factors for significantly intense reflections | 0.0885 |
Weighted residual factors for all reflections included in the refinement | 0.0979 |
Goodness-of-fit parameter for all reflections included in the refinement | 1.04 |
Diffraction radiation probe | x-ray |
Diffraction radiation wavelength | 0.71075 Å |
Diffraction radiation type | MoKα |