Information card for entry 7223914
Common name |
Quercetin Dehydrate |
Chemical name |
2-(3,4-dihydroxyphenyl)-3,5,7-trihydroxy-4H-chromen-4-one |
Formula |
C15 H10 O7 |
Calculated formula |
C60 H40 O28 |
Title of publication |
Enhancing biopharmaceutical parameters of bioflavonoid quercetin by cocrystallization. |
Authors of publication |
Vasisht, Karan; chadha, kunal; Karan, Maninder; Chadha, Renu; Bhalla, Yashika; Jena, Ashish |
Journal of publication |
CrystEngComm |
Year of publication |
2016 |
a |
14.7998 Å |
b |
11.2379 Å |
c |
10.3512 Å |
α |
90° |
β |
90° |
γ |
90° |
Cell volume |
1721.6 Å3 |
Cell temperature |
298.15 K |
Ambient diffraction temperature |
298.15 K |
Number of distinct elements |
3 |
Space group number |
33 |
Hermann-Mauguin space group symbol |
P n 21 a |
Hall space group symbol |
P -2ac -2n |
Method of determination |
powder diffraction |
Diffraction radiation probe |
x-ray |
Diffraction radiation wavelength |
1.5046 Å |
Diffraction radiation type |
CuK/a~1~ |
Yes |
No |
No |