Information card for entry 7223964
Common name | uranyl acrylate |
Formula | C6 H6 O6 U |
Calculated formula | C6 H6 O6 U |
Title of publication | Structural diversity of uranyl acrylates |
Authors of publication | Klepov, Vladislav V.; Vologzhanina, Anna V.; Alekseev, Evgeny V.; Pushkin, Denis V.; Serezhkina, Larisa B.; Sergeeva, Olga A.; Knyazev, Aleksandr V.; Serezhkin, Viktor N. |
Journal of publication | CrystEngComm |
Year of publication | 2016 |
Journal volume | 18 |
Journal issue | 10 |
Pages of publication | 1723 |
a | 13.314 ± 0.0011 Å |
b | 9.7055 ± 0.0008 Å |
c | 7.0691 ± 0.0009 Å |
α | 90° |
β | 90° |
γ | 90° |
Cell volume | 913.46 ± 0.16 Å3 |
Cell temperature | 300 ± 2 K |
Ambient diffraction temperature | 300 ± 2 K |
Number of distinct elements | 4 |
Space group number | 58 |
Hermann-Mauguin space group symbol | P n n m |
Hall space group symbol | -P 2 2n |
Residual factor for all reflections | 0.049 |
Residual factor for significantly intense reflections | 0.032 |
Weighted residual factors for significantly intense reflections | 0.0686 |
Weighted residual factors for all reflections included in the refinement | 0.0788 |
Goodness-of-fit parameter for all reflections included in the refinement | 1.047 |
Diffraction radiation wavelength | 0.71073 Å |
Diffraction radiation type | MoKα |